{"text_format":"1","workbook":"xlsx","n_sheets":10,"sheets":["Paycode generieren","Batch-Generierung","Liste","Paycode-Vorlagen","E-Mail erzeugen","Info","Benutzerdaten","Basisdaten","Ergebnis","Translate"],"not_rendered":{"charts":0,"images":17,"macros":1,"external_links":0,"defined_names":24,"comments":6,"pivot_tables":0},"unopened":[],"bounds":{"document_bytes":16777216,"sheet_cells":100000,"rows_first":2000,"rows_last":500,"rows_between":2000,"halvings":0,"cell_chars":16384,"cell_head_chars":4096},"cells_cut":0,"cells_raw":0,"read":"row_number_cap","date_system":"1900"}

{"sheet":"Paycode generieren","index":0,"n_rows":33,"n_cols":6,"rows_kept":33,"cut":false,"hidden":false,"merged":[[13,4,13,5],[6,4,6,5],[9,4,9,5],[10,4,10,5],[11,4,11,5],[12,4,12,5]]}
[]
[null,{"$f":"INDEX(Translate!$B$21:$J$1001,Translate!A21,Translate!$F$3)","v":"Paycode generieren"}]
[]
[]
[]
[]
[null,{"$f":"INDEX(Translate!$B$21:$J$1001,Translate!A22,Translate!$F$3)","v":"Einzeldaten für den Paycode"}]
[null,{"$f":"INDEX(Translate!$B$21:$J$1001,Translate!A23,Translate!$F$3)","v":"Geben Sie hier Ihre Daten für den Paycode direkt ein oder wählen Sie eine Vorlage aus."}]
[null,{"$f":"INDEX(Translate!$B$21:$J$1001,Translate!A24,Translate!$F$3)","v":"Vorlage auswählen"},":",null,null,{"$f":"INDEX(Translate!$B$21:$J$1001,Translate!A31,Translate!$F$3)","v":"Prüfung"}]
[null,{"$f":"INDEX(Translate!$B$21:$J$1001,Translate!A25,Translate!$F$3)","v":"Verwendungszwecke 1 *"},":",null,{"$f":"IF(N_reason_1<>\"\",IF(LEN(N_reason_1)<28,\"OK\",\"Zu viele Zeichen\"),\"\")","v":""}]
[null,{"$f":"INDEX(Translate!$B$21:$J$1001,Translate!A26,Translate!$F$3)","v":"Verwendungszwecke 2 *"},":",null,{"$f":"IF(N_reason_2<>\"\",IF(LEN(N_reason_2)<28,\"OK\",\"Zu viele Zeichen\"),\"\")","v":""}]
[null,{"$f":"INDEX(Translate!$B$21:$J$1001,Translate!A27,Translate!$F$3)","v":"Betrag *"},":",null,{"$f":"IF(N_amount<>\"\",IF(ISNUMBER(D12)=TRUE,\"OK\",\"Nur Zahlen möglich\"),\"\")","v":""}]
[null,{"$f":"INDEX(Translate!$B$21:$J$1001,Translate!A28,Translate!$F$3)","v":"Gültig ab [TT.MM.JJJJ]"},":",null,{"$f":"IF(N_start_date<>\"\",\"OK\",\"\")","v":""}]
[null,{"$f":"INDEX(Translate!$B$21:$J$1001,Translate!A29,Translate!$F$3)","v":"Gültig bis [TT.MM.JJJJ]"},":",null,{"$f":"IF(N_end_date<>\"\",\"OK\",\"\")","v":""}]
[]
[null,{"$f":"INDEX(Translate!$B$21:$J$1001,Translate!A30,Translate!$F$3)","v":"* Pflichtfelder müssen gefüllt werden"}]
[]
[]
[]
[]
[]
[null,{"$f":"INDEX(Translate!$B$21:$J$1001,Translate!A33,Translate!$F$3)","v":"Hyperlink"},":",null,null,{"$f":"INDEX(Translate!$B$21:$J$1001,Translate!A32,Translate!$F$3)","v":"         kopieren"}]
[null,{"$f":"INDEX(Translate!$B$21:$J$1001,Translate!A34,Translate!$F$3)","v":"Paycode"},":",null,null,{"$f":"INDEX(Translate!$B$21:$J$1001,Translate!A32,Translate!$F$3)","v":"         kopieren"}]
[]
[]
[]
[]
[]
[]
[]
{"$rows_left_out":4}
{"sheet":"Batch-Generierung","index":1,"n_rows":10,"n_cols":13,"rows_kept":10,"cut":false,"hidden":false,"merged":[[6,5,6,6],[6,11,6,12]],"read":"row_number_cap"}
[]
[null,null,{"$f":"INDEX(Translate!$B$21:$J$1001,Translate!A101,Translate!$F$3)","v":"Paycode Batch-Generierung"}]
[]
[]
[]
[]
[null,null,{"$f":"INDEX(Translate!$B$21:$J$1001,Translate!A102,Translate!$F$3)","v":"Daten für die Paycode Batch-Generierung"}]
[null,null,{"$f":"INDEX(Translate!$B$21:$J$1001,Translate!A103,Translate!$F$3)","v":"Geben Sie hier Ihre Daten für den Paycode zur Batch-Verarbeitung ein. Mit einem Klick auf die Schaltfläche \"Paycodes generieren\" wird für alle Zahlungen ein Paycode erzeugt."}]
[]
[null,null,{"$f":"INDEX(Translate!$B$21:$J$1001,Translate!A104,Translate!$F$3)&Benutzerdaten!$F$16","v":"Betrag * EUR"},{"$f":"INDEX(Translate!$B$21:$J$1001,Translate!A105,Translate!$F$3)","v":"Verwendungszwecke 1 *"},{"$f":"INDEX(Translate!$B$21:$J$1001,Translate!A106,Translate!$F$3)","v":"Verwendungszwecke 2 *"},{"$f":"INDEX(Translate!$B$21:$J$1001,Translate!A107,Translate!$F$3)","v":"Gültig ab"},{"$f":"INDEX(Translate!$B$21:$J$1001,Translate!A108,Translate!$F$3)","v":"Gültig bis"},null,null,null,{"$f":"INDEX(Translate!$B$21:$J$1001,Translate!A109,Translate!$F$3)","v":"Erzeugt am"},{"$f":"INDEX(Translate!$B$21:$J$1001,Translate!A110,Translate!$F$3)","v":"Paycode"},{"$f":"INDEX(Translate!$B$21:$J$1001,Translate!A111,Translate!$F$3)","v":"Payment Hyperlink"}]

{"sheet":"Liste","index":2,"n_rows":26,"n_cols":13,"rows_kept":26,"cut":false,"hidden":false,"merged":[]}
[]
[null,{"$f":"INDEX(Translate!$B$21:$J$1001,Translate!A201,Translate!$F$3)","v":"Paycode Übersichts-Liste"}]
[]
[]
[]
[]
[null,{"$f":"INDEX(Translate!$B$21:$J$1001,Translate!A202,Translate!$F$3)","v":"In dieser Übersicht werden alle erzeugten Paycodes aufgelistet. Darüber hinaus können Sie über die Schaltfläche \"Paycode Status abfragen\" den Status der Paycodes aktualisieren."}]
[null,{"$f":"INDEX(Translate!$B$21:$J$1001,Translate!A205,Translate!$F$3)","v":"Zeitstempel"},null,{"$f":"INDEX(Translate!$B$21:$J$1001,Translate!A206,Translate!$F$3)","v":"Verwendungszweck"},{"$f":"INDEX(Translate!$B$21:$J$1001,Translate!A207,Translate!$F$3)","v":"Betrag"},{"$f":"INDEX(Translate!$B$21:$J$1001,Translate!A208,Translate!$F$3)","v":"Whrg."},{"$f":"INDEX(Translate!$B$21:$J$1001,Translate!A209,Translate!$F$3)","v":"Datum Gültig ab"},{"$f":"INDEX(Translate!$B$21:$J$1001,Translate!A210,Translate!$F$3)","v":"Datum Gültig bis"},{"$f":"INDEX(Translate!$B$21:$J$1001,Translate!A211,Translate!$F$3)","v":"Status"},null,{"$f":"INDEX(Translate!$B$21:$J$1001,Translate!A212,Translate!$F$3)","v":"Paycode"},{"$f":"INDEX(Translate!$B$21:$J$1001,Translate!A213,Translate!$F$3)","v":"Payment Hyperlink"}]
[]
[]
[]
[]
[]
[]
[]
[]
[]
[]
[]
[]
[]
[]
[]
[]
[]
[null,null,null,null,null,null,null,null,null,null,null,null,"https://www.sofort.com/paycode/da80060f32"]

{"sheet":"Paycode-Vorlagen","index":3,"n_rows":15,"n_cols":8,"rows_kept":15,"cut":false,"hidden":false,"merged":[]}
[]
[null,null,{"$f":"INDEX(Translate!$B$21:$J$1001,Translate!A301,Translate!$F$3)","v":"Paycode Vorlagen verwalten"}]
[]
[]
[]
[]
[]
[]
[null,null,{"$f":"INDEX(Translate!$B$21:$J$1001,Translate!A302,Translate!$F$3)","v":"Vorlage in das Zahlungsformular übernehmen"}]
[null,null,{"$f":"INDEX(Translate!$B$21:$J$1001,Translate!A303,Translate!$F$3)","v":"Definieren Sie beliebig viele Paycode-Vorlagen. Diese können Sie bei Ihren Zahlungsvorgängen entsprechend verwenden."}]
[]
[null,null,null,{"$f":"IF($C$12<>\"\",VLOOKUP($C$12,$C$14:$H$1000,2,0),\"\")","v":""},{"$f":"IF($C$12<>\"\",VLOOKUP($C$12,$C$14:$H$1000,3,0),\"\")","v":""},{"$f":"IF($C$12<>\"\",VLOOKUP($C$12,$C$14:$H$1000,4,0),\"\")","v":""},{"$f":"IF($C$12<>\"\",IF(VLOOKUP($C$12,$C$14:$H$1000,5,0) = 0,\"\",VLOOKUP($C$12,$C$14:$H$1000,5,0)),\"\")","v":""},{"$f":"IF($C$12<>\"\",IF(VLOOKUP($C$12,$C$14:$H$1000,6,0)=0,\"\",VLOOKUP($C$12,$C$14:$H$1000,6,0)),\"\")","v":""}]
[null,null,{"$f":"INDEX(Translate!$B$21:$J$1001,Translate!A304,Translate!$F$3)","v":"Vorlage"},{"$f":"INDEX(Translate!$B$21:$J$1001,Translate!A305,Translate!$F$3)","v":"Verwendungszwecke 1*"},{"$f":"INDEX(Translate!$B$21:$J$1001,Translate!A306,Translate!$F$3)","v":"Verwendungszwecke 2*"},{"$f":"INDEX(Translate!$B$21:$J$1001,Translate!A307,Translate!$F$3)&\" \" &Benutzerdaten!$F$16","v":"Betrag* EUR"},{"$f":"INDEX(Translate!$B$21:$J$1001,Translate!A308,Translate!$F$3)","v":"Gültig ab"},{"$f":"INDEX(Translate!$B$21:$J$1001,Translate!A309,Translate!$F$3)","v":"Gültig bis"}]
[null,null,"Testvorlage 1","Beispiel 1","Bestell-Nr 1",25,"03.08.2015 00:00:00","2015-12-26"]
[null,null,"Testvorlage 2","Beispiel 2","Bestell-Nr 2",26,"10.08.2015 00:00:00","2015-11-30"]

{"sheet":"E-Mail erzeugen","index":4,"n_rows":12,"n_cols":3,"rows_kept":12,"cut":false,"hidden":false,"merged":[[6,3,6,4],[7,3,7,4],[11,1,11,4],[10,2,10,4],[5,1,5,6]]}
[]
[null,{"$f":"INDEX(Translate!$B$21:$J$1001,Translate!A401,Translate!$F$3)","v":"E-Mail erzeugen und versenden"}]
[]
[]
[]
[null,{"$f":"INDEX(Translate!$B$21:$J$1001,Translate!A402,Translate!$F$3)","v":"Geben Sie hier die Daten für den E-Mailversand an. Die Platzhalter werden automatisch mit den Werten des Paycodes aus dem Reiter \"Generieren\" bzw. der gewählten Vorlage belegt."}]
[null,{"$f":"INDEX(Translate!$B$21:$J$1001,Translate!A405,Translate!$F$3)","v":"E-Mail Empfänger (To)"},":"]
[null,{"$f":"INDEX(Translate!$B$21:$J$1001,Translate!A406,Translate!$F$3)","v":"E-Mail Kopie (CC)"},":"]
[]
[null,{"$f":"INDEX(Translate!$B$21:$J$1001,Translate!A407,Translate!$F$3)","v":"E-Mail Text"}]
[null,{"$f":"INDEX(Translate!$B$21:$J$1001,Translate!A408,Translate!$F$3)","v":"Betreff"},"Ihre Bestellung bei der Muster GmbH"]
[null,"Sehr geehrte Damen und Herren,\n\nherzlichen Dank für Ihren Einkauf von <VERWENDUNGSZWECK1> bei der Muster GmbH. \nIhr Rechnungsbetrag lautet <BETRAG> <WAEHRUNG> inkl. Umsatzsteuer.\n\nZahlen Sie diesen Betrag nun gleich mit SOFORT Überweisung über diesen Link:\n<PAYCODELINK>\n\nAlternativ geben Sie den Paycode <PAYCODE> einfach auf unserer Website www.sofort.com/paycode ein.\n\nDer Paycode ist gültig bis zum <GUELTIG-BIS>.\n\nMit freundlichen Grüßen\n"]

{"sheet":"Info","index":5,"n_rows":36,"n_cols":11,"rows_kept":36,"cut":false,"hidden":false,"merged":[[35,2,35,4],[34,2,34,4],[29,8,29,9]]}
[]
[null,{"$f":"INDEX(Translate!$B$21:$J$1001,Translate!A501,Translate!$F$3)","v":"Information"}]
[]
[]
[]
[]
[null,{"$f":"INDEX(Translate!$B$21:$J$1001,Translate!A502,Translate!$F$3)","v":"xls-PAYCODE ist ein Excel-Programm mit dem SOFORT Überweisungen über den Dienst der SOFORT AG einfach und schnell erstellt werden können."}]
[null,{"$f":"INDEX(Translate!$B$21:$J$1001,Translate!A503,Translate!$F$3)","v":"Es sind nur wenige Schritte dafür notwendig:"}]
[null,{"$f":"INDEX(Translate!$B$21:$J$1001,Translate!A504,Translate!$F$3)","v":"1. Eingabe der Überweisungsdaten wie Betrag, Verwendungszweck und Datum der Überweisung"}]
[null,{"$f":"INDEX(Translate!$B$21:$J$1001,Translate!A505,Translate!$F$3)","v":"2. Paycode bzw. Paycode-Link generieren"}]
[null,{"$f":"INDEX(Translate!$B$21:$J$1001,Translate!A506,Translate!$F$3)","v":"3. Paycode-Link an Käufer senden, z. B. per E-Mail"}]
[null,{"$f":"INDEX(Translate!$B$21:$J$1001,Translate!A507,Translate!$F$3)","v":"4. Käufer kann über den Paycode-Link oder den Paycode auf der Seite www.sofort.com/paycode die Überweisung ausführen"}]
[]
[null,{"$f":"INDEX(Translate!$B$21:$J$1001,Translate!A508,Translate!$F$3) & \" \" & K32 & \" \" & INDEX(Translate!$B$21:$J$1001,Translate!A509,Translate!$F$3)","v":"Bei der vorliegenden Version handelt es sich um eine Trial-Version mit folgenden Funktionen:"}]
[null,{"$f":"INDEX(Translate!$B$21:$J$1001,Translate!A510,Translate!$F$3)","v":" - Es können beliebig viele Vorlagen gespeichert werden"}]
[null,{"$f":"INDEX(Translate!$B$21:$J$1001,Translate!A511,Translate!$F$3)","v":" - Es können beliebig viele E-Mails versendet werden"}]
[null,{"$f":"INDEX(Translate!$B$21:$J$1001,Translate!A512,Translate!$F$3)","v":" - E-Mails können unter Verwendung von <PLATZHALTERN> individuell erstellt werden."}]
[null,{"$f":"INDEX(Translate!$B$21:$J$1001,Translate!A513,Translate!$F$3)","v":" - Nach dem Erwerb der Vollversion erhalten Sie einen Freischaltcode, mit dem die bestehende Datei freigeschaltet wird. Damit können "}]
[null,{"$f":"INDEX(Translate!$B$21:$J$1001,Translate!A514,Translate!$F$3)","v":"    alle bereits eingetragenen Daten wie Vorlagen etc. weiter verwendet werden."}]
[null,{"$f":"IF(K32=\"Trial-Version\", INDEX(Translate!$B$21:$J$1001,Translate!A515,Translate!$F$3) &\" \" &N_AnzDemo&\" \" & INDEX(Translate!$B$21:$J$1001,Translate!A516,Translate!$F$3),INDEX(Translate!$B$21:$J$1001,Translate!A517,Translate!$F$3))","v":"Es können maximal 100 Paycodes erzeugt werden"}]
[]
[null,{"$f":"INDEX(Translate!$B$21:$J$1001,Translate!A518,Translate!$F$3)","v":"Das Programm wurde in Zusammenarbeit mit der Firma Excel-Inside Solutions entwickelt, welche auch den Support übernimmt."}]
[]
[null,{"$f":"INDEX(Translate!$B$21:$J$1001,Translate!A519,Translate!$F$3)","v":"Wenn Sie sich für eine Vollversion des Programms interessieren, können Sie jederzeit gerne auf die Firma Excel-Inside Solutions zukommen"}]
[null,{"$f":"INDEX(Translate!$B$21:$J$1001,Translate!A520,Translate!$F$3)","v":"oder diese direkt auf der Webseite  "},null,null,null,null,{"$f":"INDEX(Translate!$B$21:$J$1001,Translate!A521,Translate!$F$3)","v":"bestellen."}]
[null,{"$f":"INDEX(Translate!$B$21:$J$1001,Translate!A522,Translate!$F$3)","v":"Gerne berät und unterstützt Sie Excel-Inside Solutions auch, wenn es um die individuelle Anpassung des vorliegenden Programms auf"}]
[null,{"$f":"INDEX(Translate!$B$21:$J$1001,Translate!A523,Translate!$F$3)","v":"Ihre Bedürfnisse geht. Sie sagen einfach, welche Funktion oder Erweiterung Sie benötigen und Excel-Inside Solutions setzt sich "}]
[null,{"$f":"INDEX(Translate!$B$21:$J$1001,Translate!A524,Translate!$F$3)","v":"umgehend mit Ihnen in Verbindung."}]
[]
[null,{"$f":"INDEX(Translate!$B$21:$J$1001,Translate!A525,Translate!$F$3)","v":"Kontakt Excel-Inside Solutions"},null,null,null,{"$f":"INDEX(Translate!$B$21:$J$1001,Translate!A526,Translate!$F$3)","v":"Kontakt Sofort GmbH"},null,null,{"$f":"INDEX(Translate!$B$21:$J$1001,Translate!A531,Translate!$F$3)","v":"Funktionen"},null,{"$f":"INDEX(Translate!$B$21:$J$1001,Translate!A532,Translate!$F$3)","v":"Version"}]
{"$rows_left_out":7}
{"sheet":"Benutzerdaten","index":6,"n_rows":137,"n_cols":11,"rows_kept":137,"cut":false,"hidden":false,"merged":[[15,3,15,4],[15,6,15,8],[22,3,22,5],[10,3,10,8],[11,3,11,8],[12,3,12,8],[13,3,13,8],[14,3,14,8],[35,5,35,8],[23,3,23,5],[17,3,17,5],[18,3,18,5],[19,3,19,5]]}
[]
[null,{"$f":"INDEX(Translate!$B$21:$J$1001,Translate!A601,Translate!$F$3)","v":"Benutzerdaten"}]
[]
[]
[]
[]
[]
[]
[null,{"$f":"INDEX(Translate!$B$21:$J$1001,Translate!A602,Translate!$F$3)","v":"Erfassen Sie bitte in die grau hinterlegten Felder Ihre Daten. Zwingend notwendig ist der Konfigurationsschlüssel."}]
[]
[null,{"$f":"INDEX(Translate!$B$21:$J$1001,Translate!A603,Translate!$F$3)","v":"Konfigurationsschlüssel"},":",null,null,null,null,null,null,null,false]
[null,{"$f":"INDEX(Translate!$B$21:$J$1001,Translate!A604,Translate!$F$3)","v":"Erfolgs URL"},":",null,null,null,null,null,null,null,false]
[null,{"$f":"INDEX(Translate!$B$21:$J$1001,Translate!A605,Translate!$F$3)","v":"Abbruch URL"},":"]
[null,{"$f":"INDEX(Translate!$B$21:$J$1001,Translate!A606,Translate!$F$3)","v":"Benachrichtigungs E-Mail"},":"]
[null,"Kundenvariable",":"]
[null,{"$f":"INDEX(Translate!$B$21:$J$1001,Translate!A607,Translate!$F$3)","v":"Währung"},":","Euro [EUR]",null,{"$f":"VLOOKUP(D16,Basisdaten!$A$201:$D$365,2,0)","v":"EUR"},{"$f":"VLOOKUP(D16,Basisdaten!$A$201:$D$365,4,0)","v":"Europäische Währungsunion "}]
[]
[null,{"$f":"INDEX(Translate!$B$21:$J$1001,Translate!A608,Translate!$F$3)","v":"Kundennummer"},":",{"$f":"IF(D11<>\"\",LEFT(D11,SEARCH(\":\",D11,1)-1),\"\")","v":""},null,null,null,{"$f":"INDEX(Translate!$B$21:$J$1001,Translate!A615,Translate!$F$3)","v":"Sprache"},"German"]
[null,{"$f":"INDEX(Translate!$B$21:$J$1001,Translate!A609,Translate!$F$3)","v":"Projektnummer"},":",{"$f":"IF(D11<>\"\",MID(D11,SEARCH(\":\",D11,1)+1,SEARCH(\":\",D11,SEARCH(\":\",D11,1)+2)-SEARCH(\":\",D11,1)-1),\"\")","v":""}]
[null,{"$f":"INDEX(Translate!$B$21:$J$1001,Translate!A610,Translate!$F$3)","v":"API Key"},":",{"$f":"IF(D11<>\"\",RIGHT(D11,LEN(D11)-SEARCH(\":\",D11,SEARCH(\":\",D11,1)+2)),\"\")","v":""}]
[]
[]
[null,{"$f":"INDEX(Translate!$B$21:$J$1001,Translate!A611,Translate!$F$3)","v":"Proxy-Server verwenden"},":","Nein"]
[null,{"$f":"INDEX(Translate!$B$21:$J$1001,Translate!A612,Translate!$F$3)","v":"Proxy IP-Adresse:Port"},":","http://219.93.183.106:8080"]
[]
[]
[]
[]
[]
[]
{"$rows_left_out":108}
{"sheet":"Basisdaten","index":7,"n_rows":301,"n_cols":4,"rows_kept":301,"cut":false,"hidden":true,"merged":[[60,0,60,1]]}
["Basisdaten für die Generierung von Sofortüberweisungen"]
[]
["Projekt Nummer",{"$f":"IF(Benutzerdaten!D19<>\"\",Benutzerdaten!D19,\"\")","v":""}]
["Sprache",{"$f":"IF(Benutzerdaten!D21<>\"\",Benutzerdaten!D21,\"\")","v":""}]
["Währung",{"$f":"IF(Benutzerdaten!F16<>\"\",Benutzerdaten!F16,\"\")","v":"EUR"}]
["Erfolgs_URL",{"$f":"IF(Benutzerdaten!D12<>\"\",Benutzerdaten!D12,\"\")","v":""}]
["Abbruch_URL",{"$f":"IF(Benutzerdaten!D13<>\"\",Benutzerdaten!D13,\"\")","v":""}]
["Käuferschutz",1,"nicht relevant"]
["Kundenvariable",{"$f":"IF(Benutzerdaten!D15<>\"\",Benutzerdaten!D15,\"\")","v":""}]
["Benachrichtigung http","http://www.sofort.com/notify3.php","nicht relevant"]
["Benachrichtigung eMail",{"$f":"IF(Benutzerdaten!D14<>\"\",Benutzerdaten!D14,\"\")","v":""}]
["Konfigurationsschlüssel",{"$f":"IF(Benutzerdaten!D11<>\"\",Benutzerdaten!D11,\"\")","v":""}]
["Kd-Nr",{"$f":"IF(Benutzerdaten!D18<>\"\",Benutzerdaten!D18,\"\")","v":""}]
["API Key",{"$f":"IF(Benutzerdaten!D20<>\"\",Benutzerdaten!D20,\"\")","v":""}]
[]
[]
[]
[]
[]
[]
[]
[]
[]
[]
[]
[]
[]
[]
[]
[]
{"$rows_left_out":272}
{"sheet":"Ergebnis","index":8,"n_rows":25,"n_cols":4,"rows_kept":25,"cut":false,"hidden":true,"merged":[]}
["Paycode Initialisierung Response",null,"Initial Request","Fehlerwerte bereinigt"]
["Original Response","<?xml version=\"1.0\" encoding=\"UTF-8\" ?>\n<new_paycode><paycode>3339a6a2bc</paycode><paycode_url>https://www.sofort.com/paycode/3339a6a2bc</paycode_url></new_paycode>","<?xml version=\"1.0\" encoding=\"UTF-8\"?><paycode><project_id>178572</project_id><interface_version>xlsm-interface</interface_version><language_code></language_code><start_date>2014-11-29 00:00:00</start_date><end_date>2015-12-31 00:00:00</end_date><amount>123</amount><currency_code>EUR</currency_code><reasons><reason>test 4</reason><reason> </reason></reasons><success_url>https://www.sofort.com/ger-DE/kaeufer/sp/rechnung-sofort-ueberweisung-paycode/</success_url><success_link_redirect>0</success_link_redirect><abort_url>https://www.sofort.com/ger-DE/kaeufer/sp/sofort-ueberweisung-paycode-sicher/</abort_url><notification_emails><notification_email>test@test.de</notification_email></notification_emails></paycode>",{"$f":"MID(B2,SEARCH(\"<message>\",B2)+9,SEARCH(\"</message>\",B2)-(SEARCH(\"<message>\",B2)+9))","v":{"$error":"#VALUE!"}}]
["paycode",{"$f":"MID($B$2,FIND(\"<\"&A3&\">\",$B$2)+ LEN(A3)+2,FIND(\"</\"&A3,$B$2)-FIND(\"<\"&A3&\">\",$B$2)-LEN(A3)-2)","v":"3339a6a2bc"},{"$f":"IF(ISERROR(B3)=FALSE,\"OK\",\"Fehler\")","v":"OK"}]
["paycode_url",{"$f":"MID($B$2,FIND(\"<\"&A4&\">\",$B$2)+ LEN(A4)+2,FIND(\"</\"&A4,$B$2)-FIND(\"<\"&A4&\">\",$B$2)-LEN(A4)-2)","v":"https://www.sofort.com/paycode/3339a6a2bc"},{"$f":"IF(ISERROR(B4)=FALSE,\"OK\",\"Fehler\")","v":"OK"}]
["Hyperlink",{"$f":"HYPERLINK(B4,B4)","v":"https://www.sofort.com/paycode/3339a6a2bc"}]
["Paycode Details Response"]
["Original Response","<?xml version=\"1.0\" encoding=\"UTF-8\" ?>\n<paycode_details><status>open</status><paycode>3339a6a2bc</paycode><project_id>178572</project_id><amount>123</amount><reasons><reason>test 4</reason></reasons><time_created>2015-04-23T10:13:40+02:00</time_created><time_used /><start_date>2014-11-29T00:00:00+01:00</start_date><end_date>2015-12-31T00:00:00+01:00</end_date><currency_code>EUR</currency_code><transaction /></paycode_details>"]
["paycode",{"$f":"MID($B$2,FIND(\"<\"&A8&\">\",$B$2)+ LEN(A8)+2,FIND(\"</\"&A8,$B$2)-FIND(\"<\"&A8&\">\",$B$2)-LEN(A8)-2)","v":"3339a6a2bc"}]
["paycode_url",{"$f":"MID($B$2,FIND(\"<\"&A9&\">\",$B$2)+ LEN(A9)+2,FIND(\"</\"&A9,$B$2)-FIND(\"<\"&A9&\">\",$B$2)-LEN(A9)-2)","v":"https://www.sofort.com/paycode/3339a6a2bc"}]
["Hyperlink",{"$f":"HYPERLINK(B9,B9)","v":"https://www.sofort.com/paycode/3339a6a2bc"}]
[]
["status",{"$f":"MID($B$7,FIND(\"<\"&A12&\">\",$B$7)+ LEN(A12)+2,FIND(\"</\"&A12,$B$7)-FIND(\"<\"&A12&\">\",$B$7)-LEN(A12)-2)","v":"open"}]
["project_id",{"$f":"MID($B$7,FIND(\"<\"&A13&\">\",$B$7)+ LEN(A13)+2,FIND(\"</\"&A13,$B$7)-FIND(\"<\"&A13&\">\",$B$7)-LEN(A13)-2)","v":"178572"}]
["transaction",{"$f":"IF(ISERROR(FIND(A14 & \" /\",B7)),MID($B$7,FIND(\"<\"&A14&\">\",$B$7)+ LEN(A14)+2,FIND(\"</\"&A14,$B$7)-FIND(\"<\"&A14&\">\",$B$7)-LEN(A14)-2),\"\")","v":""}]
["amount",{"$f":"MID($B$7,FIND(\"<\"&A15&\">\",$B$7)+ LEN(A15)+2,FIND(\"</\"&A15,$B$7)-FIND(\"<\"&A15&\">\",$B$7)-LEN(A15)-2)","v":"123"}]
["reason",{"$f":"MID($B$7,FIND(\"<\"&A16&\">\",$B$7)+ LEN(A16)+2,FIND(\"</\"&A16,$B$7)-FIND(\"<\"&A16&\">\",$B$7)-LEN(A16)-2)","v":"test 4"}]
["reason",{"$f":"MID($B$7,FIND(\"</\"&A17&\"><\"&A17&\">\",$B$7)+2* LEN(A17)+5,FIND(\"</\"&A17,$B$7,FIND(\"</\"&A17,$B$7)+LEN(A17))-FIND(\"</\"&A17&\"><\"&A17&\">\",$B$7)-2*LEN(A17)-5)","v":{"$error":"#VALUE!"}}]
["time_created",{"$f":"REPLACE(MID($B$7,FIND(\"<\"&A18&\">\",$B$7)+ LEN(A18)+2,FIND(\"</\"&A18,$B$7)-FIND(\"<\"&A18&\">\",$B$7)-LEN(A18)-2),11,1,\"  \")","v":"2015-04-23  10:13:40+02:00"}]
["start_date",{"$f":"REPLACE(MID($B$7,FIND(\"<\"&A19&\">\",$B$7)+ LEN(A19)+2,FIND(\"</\"&A19,$B$7)-FIND(\"<\"&A19&\">\",$B$7)-LEN(A19)-2),11,1,\"  \")","v":"2014-11-29  00:00:00+01:00"}]
["end_date",{"$f":"REPLACE(MID($B$7,FIND(\"<\"&A20&\">\",$B$7)+ LEN(A20)+2,FIND(\"</\"&A20,$B$7)-FIND(\"<\"&A20&\">\",$B$7)-LEN(A20)-2),11,1,\"  \")","v":"2015-12-31  00:00:00+01:00"}]
["currency_code",{"$f":"MID($B$7,FIND(\"<\"&A21&\">\",$B$7)+ LEN(A21)+2,FIND(\"</\"&A21,$B$7)-FIND(\"<\"&A21&\">\",$B$7)-LEN(A21)-2)","v":"EUR"}]
["language_code",{"$f":"MID($B$7,FIND(\"<\"&A22&\">\",$B$7)+ LEN(A22)+2,FIND(\"</\"&A22,$B$7)-FIND(\"<\"&A22&\">\",$B$7)-LEN(A22)-2)","v":{"$error":"#VALUE!"}}]
["variable",{"$f":"MID($B$7,FIND(\"<\"&A23&\">\",$B$7)+ LEN(A23)+2,FIND(\"</\"&A23,$B$7)-FIND(\"<\"&A23&\">\",$B$7)-LEN(A23)-2)","v":{"$error":"#VALUE!"}}]
[]
[null,{"$f":"FIND(A14,B7)","v":399}]

{"sheet":"Translate","index":9,"n_rows":813,"n_cols":11,"rows_kept":813,"cut":false,"hidden":true,"merged":[]}
["Übersetzungstabelle Deutsch / Englisch"]
[null,"Verfügbare Sprachen",null,"Maßgeblich für DropDown-Feld"]
[null,"Deutsch",1,{"$f":"INDEX(B$801:K$810,C3,$F$3)","v":"Deutsch"},"Gewählte Sprache:",{"$f":"IF(ISERROR(VLOOKUP(Benutzerdaten!I18,Translate!B3:C12,2,0)),1,VLOOKUP(Benutzerdaten!I18,Translate!B3:C12,2,0))","v":1}]
[null,"Englisch",2,{"$f":"INDEX(B$801:K$810,C4,$F$3)","v":"Englisch"}]
[null,"Spanisch",3,"Spanisch"]
[null,"Französisch",4,"Französisch"]
[null,"Polnisch",5,"Polnisch"]
[null,"Niederländisch",6,"Niederländisch"]
[null,"Italienisch",7,"Italienisch"]
[null,"Ungarisch",8,"Ungarisch"]
[null,"Slowakisch",9,"Slowakisch"]
[null,"Tchechisch",10,"Tchechisch"]
[]
[]
[]
[]
[]
[]
["Nr.","Deutsch","Englisch","Spanisch","Französisch","Polnisch","Niederländisch","Italienisch","Ungarisch","Slowakisch","Tchechisch"]
["Blatt \"Paycode generieren\""]
[1,"Paycode generieren","Generate Paycode","Generar Paycode","Générer un Paycode","Wygeneruj Paycode","Paycode genereren","Genera Paycode","Paycode generálása","Generovať Paycode","Generovat Paycode"]
[2,"Einzeldaten für den Paycode","Individual data for the Paycode","Datos individuales del Paycode","Données individuelles pour le Paycode","Dane do Paycode","Individuele gegevens voor de Paycode","Singoli dati per il Paycode","Egyes adatok a Paycode-hoz","Jednotlivé údaje pre Paycode","Jednotlivé údaje pro Paycode"]
[3,"Geben Sie hier Ihre Daten für den Paycode direkt ein oder wählen Sie eine Vorlage aus.","Enter your Paycode´s data directly or choose a template.","Introduzca directamente los datos de su Paycode o seleccione una plantilla.","Saisissez vos données pour le Paycode directement ici ou sélectionnez un modèle.","Podaj tu swoje dane do Paycode albo wybierz jeden wzór","Voer hier uw gegevens voor de Paycode rechtstreeks in of selecteer een template.","Inserisci direttamente qui i tuoi dati per il Paycode o seleziona un modello.","Adja meg közvetlenül adatait a Paycode-hoz itt, vagy válasszon ki egy mintát.","Zadajte svoje údaje pre Paycode priamo sem alebo si zvoľte šablónu.","Zadejte své údaje pro Paycode přímo zde nebo zvolte předlohu."]
[4,"Vorlage auswählen","Select a template","Seleccionar plantilla","Sélectionner un modèle","Wybierz wzór","Template selecteren","Seleziona un modello","Minta kiválasztása","Zvoliť šablónu","Zvolit předlohu"]
[5,"Verwendungszwecke 1 *","Reason 1 *","Concepto 1 *","Références de paiement 1 *","Tytuł przelewu 1 *","Gebruiksdoeleinden 1 *","Causale 1 *","Közlemény 1 *","Informácie pre príjemcu 1 *","Informace pro příjemce 1 *"]
[6,"Verwendungszwecke 2 *","Reason 2 *","Concepto 2 *","Références de paiement 2 *","Tytuł przelewu 2 *","Gebruiksdoeleinden 2 *","Causale 2 *","Közlemény 2 *","Informácie pre príjemcu 2 *","Informace pro příjemce 2 *"]
[7,"Betrag *","Amount *","Importe *","Montant *","Kwota *","Bedrag *","Importo *","Összeg *","Čiastka *","Částka *"]
[8,"Gültig ab [TT.MM.JJJJ]","Valid from [DD.MM.YYYY]","Válido a partir de [DD.MM.AAAA]","Valable à partir du [JJ.MM.AAAA]","ważny od [DD.MM.RRRR]","Geldig vanaf [DD.MM.JJJJ]","Valido dal [GG/MM/AAAA]","Érvényes a következő naptól [NN.HH.ÉÉÉÉ]","Platné od [DD.MM.RRRR]","Platné od [DD.MM.RRRR]"]
[9,"Gültig bis [TT.MM.JJJJ]","Valid until [DD.MM.YYYY]","Válido hasta [DD.MM.AAAA]","Valable jusqu'au [JJ.MM.AAAA]","ważny do [DD.MM.RRRR]","Geldig tot  [DD.MM.JJJJ]","Valido fino al [GG/MM/AAAA]","Érvényes a következő napig [NN.HH.ÉÉÉÉ]","Platné do [DD.MM.RRRR]","Platné do [DD.MM.RRRR]"]
[10,"* Pflichtfelder müssen gefüllt werden","* Required fields must be filled","* Es necesario rellenar los campos obligatorios","* Remplir les champs obligatoires","* Pola obowiązkowe muszą zostać wypełnione","* Verplichte velden moeten worden ingevuld","* I campi obbligatori devono essere compilati","* A mezők kitöltése kötelező ","* Povinné políčka musia byť vyplnené","* Povinná pole je nutno vyplnit"]
{"$rows_left_out":783}